Reaction Details
TargetPhotoreceptor-specific nuclear receptor
LigandBDBM75965
Substrate/Competitorn/a
Meas. Tech.TR-FRET-based biochemical high throughput dose response assay to identify NR2E3 inverse agonists
IC50 2875±n/a nM
Citation PubChem, PC TR-FRET-based biochemical high throughput dose response assay to identify NR2E3 inverse agonists PubChem Bioassay(2010)[AID]
 
Photoreceptor-specific nuclear receptor
Name:Photoreceptor-specific nuclear receptor
Type:PROTEIN
Mol. Mass.:44699.83
Organism:Homo sapiens (Human)
Description:ChEMBL_401901
Residue:410
BDBM75965
NameBDBM75965
Synonyms:MLS000050497 N-[4-(5-methyl-1,3-benzoxazol-2-yl)phenyl]-piperonylamide cid_1294813
TypeSmall organic molecule
Emp. Form.C22H16N2O4
Mol. Mass.372.3734
SMILESCc1ccc2oc(nc2c1)-c1ccc(NC(=O)c2ccc3OCOc3c2)cc1