Reaction Details
TargetPhotoreceptor-specific nuclear receptor
LigandBDBM75966
Substrate/Competitorn/a
Meas. Tech.TR-FRET-based biochemical high throughput dose response assay to identify NR2E3 inverse agonists
IC50 2438±n/a nM
Citation PubChem, PC TR-FRET-based biochemical high throughput dose response assay to identify NR2E3 inverse agonists PubChem Bioassay(2010)[AID]
 
Photoreceptor-specific nuclear receptor
Name:Photoreceptor-specific nuclear receptor
Type:PROTEIN
Mol. Mass.:44699.83
Organism:Homo sapiens (Human)
Description:ChEMBL_401901
Residue:410
BDBM75966
NameBDBM75966
Synonyms:MLS000102877 N-[4-(1,3-benzothiazol-2-yl)-2-thiazolyl]-2-furancarboxamide SMR000018550 | cid_4321359
TypeSmall organic molecule
Emp. Form.C15H9N3O2S2
Mol. Mass.327.381
SMILESO=C(Nc1nc(cs1)-c1nc2ccccc2s1)c1ccco1