Reaction Details
TargetPhotoreceptor-specific nuclear receptor
LigandBDBM76022
Substrate/Competitorn/a
Meas. Tech.TR-FRET-based biochemical high throughput dose response assay to identify NR2E3 inverse agonists
IC50 3383±n/a nM
Citation PubChem, PC TR-FRET-based biochemical high throughput dose response assay to identify NR2E3 inverse agonists PubChem Bioassay(2010)[AID]
 
Photoreceptor-specific nuclear receptor
Name:Photoreceptor-specific nuclear receptor
Type:PROTEIN
Mol. Mass.:44699.83
Organism:Homo sapiens (Human)
Description:ChEMBL_401901
Residue:410
BDBM76022
NameBDBM76022
Synonyms:5-bromanyl-N-[4-(6-methoxypyridazin-3-yl)phenyl]furan-2-carboxamide 5-bromo-N-[4-(6-methoxypyridazin-3-yl)phenyl]-2-furamide MLS001236653 cid_7593595
TypeSmall organic molecule
Emp. Form.C16H12BrN3O3
Mol. Mass.374.189
SMILESCOc1ccc(nn1)-c1ccc(NC(=O)c2ccc(Br)o2)cc1