Reaction Details
TargetIsoform 2 of Nuclear receptor corepressor 2 (TRAC-1)
LigandBDBM47124
Substrate/Competitorn/a
Meas. Tech.Counterscreen for NR2E3 inverse agonists
IC50 1230±n/a nM
Citation PubChem, PC Counterscreen for NR2E3 inverse agonists: TR-FRET-based biochemical high throughput dose response assay to identify inverse agonists of the interaction between peroxisome proliferator-activated receptor gamma (PPARg) and nuclear receptor co-repressor 2 (NCOR2) PubChem Bioassay(2010)[AID]
 
Isoform 2 of Nuclear receptor corepressor 2 (TRAC-1)
Name:Isoform 2 of Nuclear receptor corepressor 2 (TRAC-1)
Type:Enzyme Catalytic Domain
Mol. Mass.:81401.89
Organism:Homo sapiens (Human)
Description:Q9Y618-2 gi_116256445
Residue:766
BDBM47124
NameBDBM47124
Synonyms:MLS000087912 N-(7-methyl-[1,3]thiazolo[4,5-g][1,3]benzothiazol-2-yl)-2,3-dihydro-1,4-benzodioxine-6-carboxamide N-(7-methylthiazolo[4,5-g][1,3]benzothiazol-2-yl)-2,3-dihydro-1,4-benzodioxin-6-carboxamide cid_3245690
TypeSmall organic molecule
Emp. Form.C18H13N3O3S2
Mol. Mass.383.444
SMILESCc1nc2ccc3nc(NC(=O)c4ccc5OCCOc5c4)sc3c2s1