Reaction Details
TargetIsoform 2 of Nuclear receptor corepressor 2 (TRAC-1)
LigandBDBM48714
Substrate/Competitorn/a
Meas. Tech.Counterscreen for NR2E3 inverse agonists
IC50 736.74±n/a nM
Citation PubChem, PC Counterscreen for NR2E3 inverse agonists: TR-FRET-based biochemical high throughput dose response assay to identify inverse agonists of the interaction between peroxisome proliferator-activated receptor gamma (PPARg) and nuclear receptor co-repressor 2 (NCOR2) PubChem Bioassay(2010)[AID]
 
Isoform 2 of Nuclear receptor corepressor 2 (TRAC-1)
Name:Isoform 2 of Nuclear receptor corepressor 2 (TRAC-1)
Type:Enzyme Catalytic Domain
Mol. Mass.:81401.89
Organism:Homo sapiens (Human)
Description:Q9Y618-2 gi_116256445
Residue:766
BDBM48714
NameBDBM48714
Synonyms:2-[(4-allyl-5-phenyl-1,2,4-triazol-3-yl)thio]-N-[4-(6-methyl-1,3-benzothiazol-2-yl)phenyl]acetamide MLS000572657 N-[4-(6-methyl-1,3-benzothiazol-2-yl)phenyl]-2-[(5-phenyl-4-prop-2-enyl-1,2,4-triazol-3-yl)sulfanyl]ethanamide SMR000194157 | cid_1746420
TypeSmall organic molecule
Emp. Form.C27H23N5OS2
Mol. Mass.497.634
SMILESCc1ccc2nc(sc2c1)-c1ccc(NC(=O)CSc2nnc(-c3ccccc3)n2CC=C)cc1