Reaction Details
TargetIsoform 2 of Nuclear receptor corepressor 2 (TRAC-1)
LigandBDBM71503
Substrate/Competitorn/a
Meas. Tech.Counterscreen for NR2E3 inverse agonists
IC50 503.39±n/a nM
Citation PubChem, PC Counterscreen for NR2E3 inverse agonists: TR-FRET-based biochemical high throughput dose response assay to identify inverse agonists of the interaction between peroxisome proliferator-activated receptor gamma (PPARg) and nuclear receptor co-repressor 2 (NCOR2) PubChem Bioassay(2010)[AID]
 
Isoform 2 of Nuclear receptor corepressor 2 (TRAC-1)
Name:Isoform 2 of Nuclear receptor corepressor 2 (TRAC-1)
Type:Enzyme Catalytic Domain
Mol. Mass.:81401.89
Organism:Homo sapiens (Human)
Description:Q9Y618-2 gi_116256445
Residue:766
BDBM71503
NameBDBM71503
Synonyms:({[4-(dimethylamino)anilino]carbonyl}amino)(4-methylphenyl)dioxo-lambda~6~-sulfane 1-[4-(dimethylamino)phenyl]-3-(4-methylphenyl)sulfonylurea MLS001098045 cid_2815701
TypeSmall organic molecule
Emp. Form.C16H19N3O3S
Mol. Mass.333.405
SMILESCN(C)c1ccc(NC(=O)NS(=O)(=O)c2ccc(C)cc2)cc1