Reaction Details
TargetIsoform 2 of Nuclear receptor corepressor 2 (TRAC-1)
LigandBDBM58809
Substrate/Competitorn/a
Meas. Tech.Counterscreen for NR2E3 inverse agonists
IC50 1505±n/a nM
Citation PubChem, PC Counterscreen for NR2E3 inverse agonists: TR-FRET-based biochemical high throughput dose response assay to identify inverse agonists of the interaction between peroxisome proliferator-activated receptor gamma (PPARg) and nuclear receptor co-repressor 2 (NCOR2) PubChem Bioassay(2010)[AID]
 
Isoform 2 of Nuclear receptor corepressor 2 (TRAC-1)
Name:Isoform 2 of Nuclear receptor corepressor 2 (TRAC-1)
Type:Enzyme Catalytic Domain
Mol. Mass.:81401.89
Organism:Homo sapiens (Human)
Description:Q9Y618-2 gi_116256445
Residue:766
BDBM58809
NameBDBM58809
Synonyms:2-(2,4-dichlorophenoxy)-N-[4-(6-morpholin-4-ylpyridazin-3-yl)phenyl]acetamide 2-(2,4-dichlorophenoxy)-N-[4-[6-(4-morpholinyl)-3-pyridazinyl]phenyl]acetamide MLS001236672 cid_18581268
TypeSmall organic molecule
Emp. Form.C22H20Cl2N4O3
Mol. Mass.459.325
SMILESClc1ccc(OCC(=O)Nc2ccc(cc2)-c2ccc(nn2)N2CCOCC2)c(Cl)c1