Reaction Details
TargetApelin receptor
LigandBDBM269868
Substrate/Competitorn/a
Meas. Tech.[35S]GTPgammaS Binding Assay
pH7.5±n/a
EC50 12.0±n/a nM
Commentsextracted
Citation Chen, NChen, XChen, YFu, ZHeath, JAHorne, DBKaller, MRKhakoo, AYKopecky, DJMa, ZMihalic, JTSwaminath, GWang, XYeh, W Methods of treating heart failure US Patent US10058550 Publication Date 8/28/2018
 
Apelin receptor
Name:Apelin receptor
Type:Enzyme Catalytic Domain
Mol. Mass.:42664.06
Organism:Homo sapiens (Human)
Description:P35414
Residue:380
BDBM269868
NameBDBM269868
Synonyms:(1S,2R)—N-(4-(2,6-dimethoxyphenyl)-5-(5-methylpyridin-3-yl)-4H-1,2,4-triazol-3-yl)-1-(2-hydroxyethoxy)-1-(5-methylpyrimidin-2-yl)propane-2-sulfonamide or (1R,2S)—N-(4-(2,6-dimethoxyphenyl)-5-(5-methylpyridin-3-yl)-4H-1,2,4-triazol-3-yl)-1-(2-hydroxyethoxy)-1-(5-methylpyrimidin-2-yl)propane-2-sulfonamide US10221162, Example 395.0 | US9845310, Example 395.0
TypeSmall organic molecule
Emp. Form.C26H31N7O6S
Mol. Mass.569.633
SMILESCOc1cccc(OC)c1-n1c(NS(=O)(=O)[C@@H](C)[C@H](OCCO)c2ncc(C)cn2)nnc1-c1cncc(C)c1