Reaction Details
TargetKrueppel-like factor 5
LigandBDBM76096
Substrate/Competitorn/a
Meas. Tech.Late stage assay provider counterscreen results from the probe development effort to identify inhibitors of kruppel-like factor 5 (KLF5)
IC50 2246±n/a nM
Citation PubChem, PC Late stage assay provider counterscreen results from the probe development effort to identify inhibitors of kruppel-like factor 5 (KLF5): chemiluminescence-based western blot assay for inhibitors of KLF5 protein levels PubChem Bioassay(2010)[AID]
 
Krueppel-like factor 5
Name:Krueppel-like factor 5
Type:Enzyme Catalytic Domain
Mol. Mass.:50808.71
Organism:Homo sapiens (Human)
Description:Q13887
Residue:457
BDBM76096
NameBDBM76096
Synonyms:(E)-3-(3-nitrophenyl)-2-propenoic acid [2-[(1,1-dioxo-3-thiolanyl)-methylamino]-2-oxoethyl] ester SR-01000765880 [2-[(1,1-dioxothiolan-3-yl)-methylamino]-2-oxoethyl] (E)-3-(3-nitrophenyl)prop-2-enoate cid_5951923
TypeSmall organic molecule
Emp. Form.C16H18N2O7S
Mol. Mass.382.388
SMILESCN(C1CCS(=O)(=O)C1)C(=O)COC(=O)\C=C\c1cccc(c1)[N+]([O-])=O