Reaction Details
TargetIntestinal-type alkaline phosphatase 1
LigandBDBM76173
Substrate/Competitorn/a
Meas. Tech.Dose Response confirmation of uHTS hits from a small molecule inhibitors of mouse intestinal alkaline phosphatase via a luminescent assay
IC50 2170±n/a nM
Citation PubChem, PC Dose Response confirmation of uHTS hits from a small molecule inhibitors of mouse intestinal alkaline phosphatase via a luminescent assay PubChem Bioassay(2010)[AID]
 
Intestinal-type alkaline phosphatase 1
Name:Intestinal-type alkaline phosphatase 1
Type:Enzyme Catalytic Domain
Mol. Mass.:58396.39
Organism:Rattus norvegicus (Rat)
Description:P15693
Residue:540
BDBM76173
NameBDBM76173
Synonyms:1-(3,5-Dimethyl-phenyl)-3-(9-thiophen-2-ylmethyl-9-aza-bicyclo[3.3.1]non-3-yl)-thiourea 1-(3,5-dimethylphenyl)-3-[9-(thiophen-2-ylmethyl)-9-azabicyclo[3.3.1]nonan-3-yl]thiourea SMR000173334 | cid_3218185
TypeSmall organic molecule
Emp. Form.C22H29N3S2
Mol. Mass.399.616
SMILES[H]C12CCCC([H])(CC(C1)NC(=S)Nc1cc(C)cc(C)c1)N2Cc1cccs1