Reaction Details
TargetIntegrin alpha-4
LigandBDBM76257
Substrate/Competitorn/a
Meas. Tech.SAR Confirmatory Dose Response LIBS Assay for Allosteric Ligands of the VLA-4 Integrin
EC50 16350±n/a nM
Citation PubChem, PC SAR Confirmatory Dose Response LIBS Assay for Allosteric Ligands of the VLA-4 Integrin PubChem Bioassay(2010)[AID]
 
Integrin alpha-4
Name:Integrin alpha-4
Type:Membrane Protein
Mol. Mass.:114897.35
Organism:Homo sapiens (Human)
Description:P13612
Residue:1032
BDBM76257
NameBDBM76257
Synonyms:2-morpholino-N-(p-tolyl)-5-succinimido-benzamide 5-(2,5-dioxopyrrolidin-1-yl)-N-(4-methylphenyl)-2-morpholin-4-ylbenzamide VU0298632-2 | cid_1080131
TypeSmall organic molecule
Emp. Form.C22H23N3O4
Mol. Mass.393.4357
SMILESCc1ccc(NC(=O)c2cc(ccc2N2CCOCC2)-n2c(O)ccc2O)cc1