Reaction Details
TargetIntestinal-type alkaline phosphatase
LigandBDBM75739
Substrate/Competitorn/a
Meas. Tech.Dose Response confirmation of uHTS hits from a small molecule inhibitors of human intestinal alkaline phosphatase via a luminescent assay - Set 2
IC50 15500±n/a nM
Citation PubChem, PC Dose Response confirmation of uHTS hits from a small molecule inhibitors of human intestinal alkaline phosphatase via a luminescent assay - Set 2 PubChem Bioassay(2010)[AID]
 
Intestinal-type alkaline phosphatase
Name:Intestinal-type alkaline phosphatase
Type:PROTEIN
Mol. Mass.:56804.94
Organism:Homo sapiens (Human)
Description:ChEMBL_1278525
Residue:528
BDBM75739
NameBDBM75739
Synonyms:(1Z)-1-[(4-hydroxyphenyl)hydrazinylidene]-2-naphthalenone (1Z)-1-[(4-hydroxyphenyl)hydrazono]naphthalen-2-one MLS000578050 cid_9566592
TypeSmall organic molecule
Emp. Form.C16H12N2O2
Mol. Mass.264.2787
SMILESOc1ccc(cc1)N=Nc1c(O)ccc2ccccc12