Reaction Details
TargetIntestinal-type alkaline phosphatase
LigandBDBM48868
Substrate/Competitorn/a
Meas. Tech.Dose Response confirmation of uHTS hits from a small molecule inhibitors of human intestinal alkaline phosphatase via a luminescent assay - Set 2
IC50 10200±n/a nM
Citation PubChem, PC Dose Response confirmation of uHTS hits from a small molecule inhibitors of human intestinal alkaline phosphatase via a luminescent assay - Set 2 PubChem Bioassay(2010)[AID]
 
Intestinal-type alkaline phosphatase
Name:Intestinal-type alkaline phosphatase
Type:PROTEIN
Mol. Mass.:56804.94
Organism:Homo sapiens (Human)
Description:ChEMBL_1278525
Residue:528
BDBM48868
NameBDBM48868
Synonyms:1-ethyl-2-[(E)-2-(1H-indol-3-yl)ethenyl]-6-methyl-quinolin-1-ium;iodide 1-ethyl-2-[(E)-2-(1H-indol-3-yl)vinyl]-6-methyl-quinolin-1-ium;iodide MLS000724364 cid_16195322
TypeSmall organic molecule
Emp. Form.C22H21N2
Mol. Mass.313.415
SMILESCC[n+]1c(\C=C\c2c[nH]c3ccccc23)ccc2cc(C)ccc12