Reaction Details
TargetIntestinal-type alkaline phosphatase
LigandBDBM69390
Substrate/Competitorn/a
Meas. Tech.Dose Response confirmation of uHTS hits from a small molecule inhibitors of human intestinal alkaline phosphatase via a luminescent assay - Set 2
IC50 1970±n/a nM
Citation PubChem, PC Dose Response confirmation of uHTS hits from a small molecule inhibitors of human intestinal alkaline phosphatase via a luminescent assay - Set 2 PubChem Bioassay(2010)[AID]
 
Intestinal-type alkaline phosphatase
Name:Intestinal-type alkaline phosphatase
Type:PROTEIN
Mol. Mass.:56804.94
Organism:Homo sapiens (Human)
Description:ChEMBL_1278525
Residue:528
BDBM69390
NameBDBM69390
Synonyms:2-(3,4-dihydroxyphenyl)-7-hydroxy-8-(3-methylbut-2-enyl)-2,3-dihydrochromen-4-one 2-(3,4-dihydroxyphenyl)-7-hydroxy-8-(3-methylbut-2-enyl)chroman-4-one MLS000876983 cid_16196974
TypeSmall organic molecule
Emp. Form.C20H20O5
Mol. Mass.340.3698
SMILES[#6]\[#6](-[#6])=[#6]\[#6]-c1c(-[#8])ccc2-[#6](=O)-[#6]-[#6](-[#8]-c12)-c1ccc(-[#8])c(-[#8])c1