Reaction Details
TargetIntestinal-type alkaline phosphatase
LigandBDBM60729
Substrate/Competitorn/a
Meas. Tech.Dose Response confirmation of uHTS hits from a small molecule inhibitors of human intestinal alkaline phosphatase via a luminescent assay - Set 2
IC50 7630±n/a nM
Citation PubChem, PC Dose Response confirmation of uHTS hits from a small molecule inhibitors of human intestinal alkaline phosphatase via a luminescent assay - Set 2 PubChem Bioassay(2010)[AID]
 
Intestinal-type alkaline phosphatase
Name:Intestinal-type alkaline phosphatase
Type:PROTEIN
Mol. Mass.:56804.94
Organism:Homo sapiens (Human)
Description:ChEMBL_1278525
Residue:528
BDBM60729
NameBDBM60729
Synonyms:3-[2-[(Z)-(3-hydroxy-4-oxocyclohexa-2,5-dien-1-ylidene)methyl]hydrazinyl]indol-2-one 3-[N'-[(Z)-(3-hydroxy-4-keto-cyclohexa-2,5-dien-1-ylidene)methyl]hydrazino]indol-2-one MLS000775898 cid_16240521
TypeSmall organic molecule
Emp. Form.C15H11N3O3
Mol. Mass.281.2661
SMILESOc1ccc(C=NNC2=c3ccccc3=NC2=O)cc1O