Reaction Details
TargetIntestinal-type alkaline phosphatase
LigandBDBM75760
Substrate/Competitorn/a
Meas. Tech.Dose Response confirmation of uHTS hits from a small molecule inhibitors of human intestinal alkaline phosphatase via a luminescent assay - Set 2
IC50 30900±n/a nM
Citation PubChem, PC Dose Response confirmation of uHTS hits from a small molecule inhibitors of human intestinal alkaline phosphatase via a luminescent assay - Set 2 PubChem Bioassay(2010)[AID]
 
Intestinal-type alkaline phosphatase
Name:Intestinal-type alkaline phosphatase
Type:PROTEIN
Mol. Mass.:56804.94
Organism:Homo sapiens (Human)
Description:ChEMBL_1278525
Residue:528
BDBM75760
NameBDBM75760
Synonyms:4-(2-bromophenyl)azo-N,N-dimethylaniline 4-[(2-bromophenyl)diazenyl]-N,N-dimethylaniline SMR000588378 cid_4153146
TypeSmall organic molecule
Emp. Form.C14H14BrN3
Mol. Mass.304.185
SMILESCN(C)c1ccc(cc1)\N=N\c1ccccc1Br