Reaction Details
TargetIntestinal-type alkaline phosphatase
LigandBDBM60983
Substrate/Competitorn/a
Meas. Tech.Dose Response confirmation of uHTS hits from a small molecule inhibitors of human intestinal alkaline phosphatase via a luminescent assay - Set 2
IC50 4560±n/a nM
Citation PubChem, PC Dose Response confirmation of uHTS hits from a small molecule inhibitors of human intestinal alkaline phosphatase via a luminescent assay - Set 2 PubChem Bioassay(2010)[AID]
 
Intestinal-type alkaline phosphatase
Name:Intestinal-type alkaline phosphatase
Type:PROTEIN
Mol. Mass.:56804.94
Organism:Homo sapiens (Human)
Description:ChEMBL_1278525
Residue:528
BDBM60983
NameBDBM60983
Synonyms:(E)-2-(3,4-dihydroxybenzoyl)-3-(4-hydroxy-3-iodo-5-methoxyphenyl)prop-2-enenitrile (E)-2-[3,4-bis(oxidanyl)phenyl]carbonyl-3-(3-iodanyl-5-methoxy-4-oxidanyl-phenyl)prop-2-enenitrile I-OMe-Tyrphostin AG 538 SMR001230793 | cid_5353685
TypeSmall organic molecule
Emp. Form.C17H12INO5
Mol. Mass.437.1854
SMILESCOc1cc(\C=C(/C#N)C(=O)c2ccc(O)c(O)c2)cc(I)c1O