Reaction Details
TargetAmmonium transporter MEP2
LigandBDBM32147
Substrate/Competitorn/a
Meas. Tech.Confirmatory Cherry Pick 3 SAR Dose Response Multiplex in TOR pathway GFP-fusion proteins for Saccharomyes cerevisiae, specifically MEP2
EC50 36100000±n/a nM
Citation PubChem, PC Confirmatory Cherry Pick 3 SAR Dose Response Multiplex in TOR pathway GFP-fusion proteins for Saccharomyes cerevisiae, specifically MEP2 PubChem Bioassay(2011)[AID]
 
Ammonium transporter MEP2
Name:Ammonium transporter MEP2
Type:Enzyme Catalytic Domain
Mol. Mass.:53401.07
Organism:Saccharomyces cerevisiae
Description:gi_1302091
Residue:499
BDBM32147
NameBDBM32147
Synonyms:AS-229 cid_2722
TypeSmall organic molecule
Emp. Form.C9H5Cl2NO
Mol. Mass.214.048
SMILESOc1c(Cl)cc(Cl)c2cccnc12