Reaction Details
TargetAmmonium transporter MEP2
LigandBDBM76301
Substrate/Competitorn/a
Meas. Tech.Confirmatory Cherry Pick 3 SAR Dose Response Multiplex in TOR pathway GFP-fusion proteins for Saccharomyes cerevisiae, specifically MEP2
EC50 11320000000±n/a nM
Citation PubChem, PC Confirmatory Cherry Pick 3 SAR Dose Response Multiplex in TOR pathway GFP-fusion proteins for Saccharomyes cerevisiae, specifically MEP2 PubChem Bioassay(2011)[AID]
 
Ammonium transporter MEP2
Name:Ammonium transporter MEP2
Type:Enzyme Catalytic Domain
Mol. Mass.:53401.07
Organism:Saccharomyces cerevisiae
Description:gi_1302091
Residue:499
BDBM76301
NameBDBM76301
Synonyms:5,7-bis(bromanyl)quinolin-8-ol 5,7-dibromoquinolin-8-ol SMR000054336 | cid_2453
TypeSmall organic molecule
Emp. Form.C9H5Br2NO
Mol. Mass.302.95
SMILESOc1c(Br)cc(Br)c2cccnc12