Reaction Details
TargetLysine-specific histone demethylase 1A
LigandBDBM270464
Substrate/Competitorn/a
Meas. Tech.LSD1 enzymatic assay
pH7.5±n/a
Temperature298.15±n/a K
IC50 7.00±n/a nM
Commentsextracted
Citation Vaisburg, AMarx, MA LSD1 inhibitors US Patent US10059668 Publication Date 8/28/2018
 
Lysine-specific histone demethylase 1A
Name:Lysine-specific histone demethylase 1A
Type:Enzyme
Mol. Mass.:92901.01
Organism:Homo sapiens (Human)
Description:O60341
Residue:852
BDBM270464
NameBDBM270464
Synonyms:US10059668, Example 27 | US10059668, Example 37
TypeSmall organic molecule
Emp. Form.C28H31N3O3S
Mol. Mass.489.629
SMILESO=C(NS(=O)(=O)c1ccccc1)c1ccc(CN2CCC(CC2)N[C@@H]2C[C@H]2c2ccccc2)cc1