Reaction Details
TargetLysine-specific histone demethylase 1A
LigandBDBM270475
Substrate/Competitorn/a
Meas. Tech.LSD1 enzymatic assay
pH7.5±n/a
Temperature298.15±n/a K
IC50 6.00±n/a nM
Commentsextracted
Citation Vaisburg, AMarx, MA LSD1 inhibitors US Patent US10059668 Publication Date 8/28/2018
 
Lysine-specific histone demethylase 1A
Name:Lysine-specific histone demethylase 1A
Type:Enzyme
Mol. Mass.:92901.01
Organism:Homo sapiens (Human)
Description:O60341
Residue:852
BDBM270475
NameBDBM270475
Synonyms:US10059668, Example 38
TypeSmall organic molecule
Emp. Form.C29H33N3O3S
Mol. Mass.503.656
SMILESO=C(Cc1ccc(CN2CCC(CC2)N[C@@H]2C[C@H]2c2ccccc2)cc1)NS(=O)(=O)c1ccccc1