Reaction Details
TargetLysine-specific histone demethylase 1A
LigandBDBM270481
Substrate/Competitorn/a
Meas. Tech.LSD1 enzymatic assay
pH7.5±n/a
Temperature298.15±n/a K
IC50 5.00±n/a nM
Commentsextracted
Citation Vaisburg, AMarx, MA LSD1 inhibitors US Patent US10059668 Publication Date 8/28/2018
 
Lysine-specific histone demethylase 1A
Name:Lysine-specific histone demethylase 1A
Type:Enzyme
Mol. Mass.:92901.01
Organism:Homo sapiens (Human)
Description:O60341
Residue:852
BDBM270481
NameBDBM270481
Synonyms:US10059668, Example 44
TypeSmall organic molecule
Emp. Form.C23H29N3O2
Mol. Mass.379.4953
SMILESCONC(=O)c1ccc(CN2CCC(CC2)N[C@@H]2C[C@H]2c2ccccc2)cc1