Reaction Details
TargetIntestinal-type alkaline phosphatase
LigandBDBM46229
Substrate/Competitorn/a
Meas. Tech.Dose Response confirmation of uHTS activators of Mouse Intestinal Alkaline Phosphatase using Human Intestinal Alkaline Phosphatase
EC50 49400±n/a nM
Citation PubChem, PC Dose Response confirmation of uHTS activators of Mouse Intestinal Alkaline Phosphatase using Human Intestinal Alkaline Phosphatase PubChem Bioassay(2010)[AID]
 
Intestinal-type alkaline phosphatase
Name:Intestinal-type alkaline phosphatase
Type:PROTEIN
Mol. Mass.:56804.94
Organism:Homo sapiens (Human)
Description:ChEMBL_1278525
Residue:528
BDBM46229
NameBDBM46229
Synonyms:4-chloranyl-N-(3,4-dihydro-2H-thiochromen-4-yl)-3-sulfamoyl-benzamide 4-chloro-N-(3,4-dihydro-2H-1-benzothiopyran-4-yl)-3-sulfamoylbenzamide MLS-0336143.0001 | cid_16330874
TypeSmall organic molecule
Emp. Form.C16H15ClN2O3S2
Mol. Mass.382.885
SMILESNS(=O)(=O)c1cc(ccc1Cl)C(=O)NC1CCSc2ccccc12