Reaction Details
TargetLysine-specific demethylase 5B
LigandBDBM270500
Substrate/Competitorn/a
Meas. Tech.Jarid1B Assay
IC50<100±n/a nM
Citation Chen, YKWallace, MB Histone demethylase inhibitors US Patent US10059687 Publication Date 8/28/2018
 
Lysine-specific demethylase 5B
Name:Lysine-specific demethylase 5B
Type:Protein
Mol. Mass.:175659.67
Organism:Homo sapiens (Human)
Description:Q9UGL1
Residue:1544
BDBM270500
NameBDBM270500
Synonyms:3-[({(1S)-6-[4-(cyclopropylmethoxy)-2-methylphenyl]-1,2,3,4-tetrahydroisoquinolyl}methyl)amino]pyridine-4-carboxylic acid US11001568, Example 4A | US11731954, Example 4A
TypeSmall organic molecule
Emp. Form.C27H29N3O3
Mol. Mass.443.5375
SMILESCc1cc(OCC2CC2)ccc1-c1ccc2[C@@H](CNc3cnccc3C(O)=O)NCCc2c1