Reaction Details
TargetLysine-specific demethylase 5B
LigandBDBM270502
Substrate/Competitorn/a
Meas. Tech.Jarid1B Assay
IC50<100±n/a nM
Citation Chen, YKWallace, MB Histone demethylase inhibitors US Patent US10059687 Publication Date 8/28/2018
 
Lysine-specific demethylase 5B
Name:Lysine-specific demethylase 5B
Type:Protein
Mol. Mass.:175659.67
Organism:Homo sapiens (Human)
Description:Q9UGL1
Residue:1544
BDBM270502
NameBDBM270502
Synonyms:3-[({(1S)-5-[methyl(4-methylphenyl)amino]iso-indolinyl}methyl)amino]pyridine-4-carboxylic acid US11001568, Example 5A | US11731954, Example 5A
TypeSmall organic molecule
Emp. Form.C23H24N4O2
Mol. Mass.388.4623
SMILESCN(c1ccc(C)cc1)c1ccc2[C@@H](CNc3cnccc3C(O)=O)NCc2c1