Reaction Details
TargetLysine-specific demethylase 5B
LigandBDBM270507
Substrate/Competitorn/a
Meas. Tech.Jarid1B Assay
IC50<100±n/a nM
Citation Chen, YKWallace, MB Histone demethylase inhibitors US Patent US10059687 Publication Date 8/28/2018
 
Lysine-specific demethylase 5B
Name:Lysine-specific demethylase 5B
Type:Protein
Mol. Mass.:175659.67
Organism:Homo sapiens (Human)
Description:Q9UGL1
Residue:1544
BDBM270507
NameBDBM270507
Synonyms:3-[({(1R)-5-[2-methyl-4-(2,2,2-trifluoroethoxy)phenyl] isoindolinyl}methyl)amino]pyridine-4-carboxylic acid US11001568, Example 7B | US11731954, Example 7B
TypeSmall organic molecule
Emp. Form.C24H22F3N3O3
Mol. Mass.457.445
SMILESCc1cc(OCC(F)(F)F)ccc1-c1ccc2[C@H](CNc3cnccc3C(O)=O)NCc2c1