Reaction Details
TargetLysine-specific demethylase 5B
LigandBDBM270512
Substrate/Competitorn/a
Meas. Tech.Jarid1B Assay
IC50<100±n/a nM
Citation Chen, YKWallace, MB Histone demethylase inhibitors US Patent US10059687 Publication Date 8/28/2018
 
Lysine-specific demethylase 5B
Name:Lysine-specific demethylase 5B
Type:Protein
Mol. Mass.:175659.67
Organism:Homo sapiens (Human)
Description:Q9UGL1
Residue:1544
BDBM270512
NameBDBM270512
Synonyms:(R)-3-(((6-((4-ethylphenyl)(methyl)amino)-1,2,3,4-tetra-hydroisoquinolin-1-yl)methyl)amino)isonicotinic acid US11001568, Example 10A | US11731954, Example 10A and 10B
TypeSmall organic molecule
Emp. Form.C25H28N4O2
Mol. Mass.416.5154
SMILESCCc1ccc(cc1)N(C)c1ccc2[C@H](CNc3cnccc3C(O)=O)NCCc2c1