Reaction Details
TargetLysine-specific demethylase 5B
LigandBDBM270522
Substrate/Competitorn/a
Meas. Tech.Jarid1B Assay
IC50<100±n/a nM
Citation Chen, YKWallace, MB Histone demethylase inhibitors US Patent US10059687 Publication Date 8/28/2018
 
Lysine-specific demethylase 5B
Name:Lysine-specific demethylase 5B
Type:Protein
Mol. Mass.:175659.67
Organism:Homo sapiens (Human)
Description:Q9UGL1
Residue:1544
BDBM270522
NameBDBM270522
Synonyms:(R)-3-(((6-(2-ethylphenyl)-2-methyl-1,2,3,4-tetrahydro-isoquinolin-1-yl)methyl)amino)isonicotinic acid US11001568, Example 15A | US11731954, Example 15A and 15B
TypeSmall organic molecule
Emp. Form.C25H27N3O2
Mol. Mass.401.5008
SMILESCCc1ccccc1-c1ccc2[C@H](CNc3cnccc3C(O)=O)N(C)CCc2c1