Reaction Details
TargetLysine-specific demethylase 5B
LigandBDBM270525
Substrate/Competitorn/a
Meas. Tech.Jarid1B Assay
IC50<100±n/a nM
Citation Chen, YKWallace, MB Histone demethylase inhibitors US Patent US10059687 Publication Date 8/28/2018
 
Lysine-specific demethylase 5B
Name:Lysine-specific demethylase 5B
Type:Protein
Mol. Mass.:175659.67
Organism:Homo sapiens (Human)
Description:Q9UGL1
Residue:1544
BDBM270525
NameBDBM270525
Synonyms:(S)-3-(((6-(2-isopropylphenyl)-2-methyl-1,2,3,4-tetrahydroisoquinolin-1-yl)methyl)amino)isonicotinic acid US11001568, Example 16B
TypeSmall organic molecule
Emp. Form.C26H29N3O2
Mol. Mass.415.5274
SMILESCC(C)c1ccccc1-c1ccc2[C@@H](CNc3cnccc3C(O)=O)N(C)CCc2c1