Reaction Details
TargetLysine-specific demethylase 5B
LigandBDBM270526
Substrate/Competitorn/a
Meas. Tech.Jarid1B Assay
IC50<100±n/a nM
Citation Chen, YKWallace, MB Histone demethylase inhibitors US Patent US10059687 Publication Date 8/28/2018
 
Lysine-specific demethylase 5B
Name:Lysine-specific demethylase 5B
Type:Protein
Mol. Mass.:175659.67
Organism:Homo sapiens (Human)
Description:Q9UGL1
Residue:1544
BDBM270526
NameBDBM270526
Synonyms:(R)-3-(((6-(2,6-dimethylphenyl)-2-methyl-1,2,3,4-tetra-hydroisoquinolin-1-yl)methyl)amino)isonicotinic acid US11001568, Example 17A | US11731954, Example 17A and 17B
TypeSmall organic molecule
Emp. Form.C25H27N3O2
Mol. Mass.401.5008
SMILESCN1CCc2cc(ccc2[C@@H]1CNc1cnccc1C(O)=O)-c1c(C)cccc1C