Reaction Details
TargetIntestinal-type alkaline phosphatase
LigandBDBM43797
Substrate/Competitorn/a
Meas. Tech.Dose Response confirmation of uHTS inhibitors of Mouse Intestinal Alkaline Phosphatase using Human Intestinal Alkaline Phosphatase
IC50 9590±n/a nM
Citation PubChem, PC Dose Response confirmation of uHTS inhibitors of Mouse Intestinal Alkaline Phosphatase using Human Intestinal Alkaline Phosphatase PubChem Bioassay(2010)[AID]
 
Intestinal-type alkaline phosphatase
Name:Intestinal-type alkaline phosphatase
Type:PROTEIN
Mol. Mass.:56804.94
Organism:Homo sapiens (Human)
Description:ChEMBL_1278525
Residue:528
BDBM43797
NameBDBM43797
Synonyms:1-[(4-methoxyphenyl)-phenyl-methyl]-3-[2-(3-prop-1-en-2-ylphenyl)propan-2-yl]urea 1-[(4-methoxyphenyl)-phenylmethyl]-3-[2-[3-(1-methylethenyl)phenyl]propan-2-yl]urea MLS-0214623.0001 | cid_2901383
TypeSmall organic molecule
Emp. Form.C27H30N2O2
Mol. Mass.414.5393
SMILESCOc1ccc(cc1)C(NC(=O)NC(C)(C)c1cccc(c1)C(C)=C)c1ccccc1