Reaction Details
TargetIntestinal-type alkaline phosphatase
LigandBDBM50656
Substrate/Competitorn/a
Meas. Tech.Dose Response confirmation of uHTS inhibitors of Mouse Intestinal Alkaline Phosphatase using Human Intestinal Alkaline Phosphatase
IC50 30700±n/a nM
Citation PubChem, PC Dose Response confirmation of uHTS inhibitors of Mouse Intestinal Alkaline Phosphatase using Human Intestinal Alkaline Phosphatase PubChem Bioassay(2010)[AID]
 
Intestinal-type alkaline phosphatase
Name:Intestinal-type alkaline phosphatase
Type:PROTEIN
Mol. Mass.:56804.94
Organism:Homo sapiens (Human)
Description:ChEMBL_1278525
Residue:528
BDBM50656
NameBDBM50656
Synonyms:MLS000778637 N-[(5Z)-5-[(E)-3-(2-furyl)prop-2-enylidene]-4-keto-2-thioxo-thiazolidin-3-yl]-2-hydroxy-benzamide N-[(5Z)-5-[(E)-3-(furan-2-yl)prop-2-enylidene]-4-oxo-2-sulfanylidene-1,3-thiazolidin-3-yl]-2-hydroxybenzamide SMR000415431 | cid_5953984
TypeSmall organic molecule
Emp. Form.C17H12N2O4S2
Mol. Mass.372.418
SMILESOc1ccccc1C(=O)NN1C(=S)S\C(=C/C=C/c2ccco2)C1=O