Reaction Details
TargetIntestinal-type alkaline phosphatase
LigandBDBM54140
Substrate/Competitorn/a
Meas. Tech.Dose Response confirmation of uHTS inhibitors of Mouse Intestinal Alkaline Phosphatase using Human Intestinal Alkaline Phosphatase
IC50 3090±n/a nM
Citation PubChem, PC Dose Response confirmation of uHTS inhibitors of Mouse Intestinal Alkaline Phosphatase using Human Intestinal Alkaline Phosphatase PubChem Bioassay(2010)[AID]
 
Intestinal-type alkaline phosphatase
Name:Intestinal-type alkaline phosphatase
Type:PROTEIN
Mol. Mass.:56804.94
Organism:Homo sapiens (Human)
Description:ChEMBL_1278525
Residue:528
BDBM54140
NameBDBM54140
Synonyms:MLS001043248 N-[(5Z)-4-oxidanylidene-5-(2-oxidanylidene-1H-indol-3-ylidene)-2-sulfanylidene-1,3-thiazolidin-3-yl]benzamide N-[(5Z)-4-oxo-5-(2-oxo-1H-indol-3-ylidene)-2-sulfanylidene-3-thiazolidinyl]benzamide SMR000425314 | cid_5457058
TypeSmall organic molecule
Emp. Form.C18H11N3O3S2
Mol. Mass.381.428
SMILESO=C(NN1C(=S)S\C(C1=O)=C1/C(=O)Nc2ccccc12)c1ccccc1