Reaction Details
TargetIntestinal-type alkaline phosphatase
LigandBDBM53091
Substrate/Competitorn/a
Meas. Tech.Dose Response confirmation of uHTS inhibitors of Mouse Intestinal Alkaline Phosphatase using Human Intestinal Alkaline Phosphatase
IC50 4340±n/a nM
Citation PubChem, PC Dose Response confirmation of uHTS inhibitors of Mouse Intestinal Alkaline Phosphatase using Human Intestinal Alkaline Phosphatase PubChem Bioassay(2010)[AID]
 
Intestinal-type alkaline phosphatase
Name:Intestinal-type alkaline phosphatase
Type:PROTEIN
Mol. Mass.:56804.94
Organism:Homo sapiens (Human)
Description:ChEMBL_1278525
Residue:528
BDBM53091
NameBDBM53091
Synonyms:(2E)-5-nitro-6-oxidanyl-2-[(2Z)-2-(3-oxidanyl-4-oxidanylidene-cyclohexa-2,5-dien-1-ylidene)ethylidene]-1H-pyrimidin-4-one (2E)-6-hydroxy-2-[(2Z)-2-(3-hydroxy-4-oxo-1-cyclohexa-2,5-dienylidene)ethylidene]-5-nitro-1H-pyrimidin-4-one 2-[(Z)-2-(3,4-Dihydroxy-phenyl)-vinyl]-6-hydroxy-5-nitro-3H-pyrimidin-4-one SMR000524347 | cid_25043520
TypeSmall organic molecule
Emp. Form.C12H9N3O6
Mol. Mass.291.2164
SMILESOc1[nH+]c(\C=C\[c-]2ccc(=O)c(O)c2)[nH]c(=O)c1[N+]([O-])=O