Reaction Details
TargetIntestinal-type alkaline phosphatase
LigandBDBM76205
Substrate/Competitorn/a
Meas. Tech.Dose Response confirmation of uHTS inhibitors of Mouse Intestinal Alkaline Phosphatase using Human Intestinal Alkaline Phosphatase
IC50 2120±n/a nM
Citation PubChem, PC Dose Response confirmation of uHTS inhibitors of Mouse Intestinal Alkaline Phosphatase using Human Intestinal Alkaline Phosphatase PubChem Bioassay(2010)[AID]
 
Intestinal-type alkaline phosphatase
Name:Intestinal-type alkaline phosphatase
Type:PROTEIN
Mol. Mass.:56804.94
Organism:Homo sapiens (Human)
Description:ChEMBL_1278525
Residue:528
BDBM76205
NameBDBM76205
Synonyms:4-Fluoro-N-[4-hydroxy-3-(1H-[1,2,4]triazol-3-ylsulfanyl)-phenyl]-2-methyl-benzenesulfonamide 4-fluoro-N-[4-hydroxy-3-(1H-1,2,4-triazol-5-ylsulfanyl)phenyl]-2-methylbenzenesulfonamide 4-fluoro-N-[4-hydroxy-3-(1H-1,2,4-triazol-5-ylthio)phenyl]-2-methylbenzenesulfonamide SMR000612865 | cid_1094879
TypeSmall organic molecule
Emp. Form.C15H13FN4O3S2
Mol. Mass.380.417
SMILESCc1cc(F)ccc1S(=O)(=O)Nc1ccc(O)c(Sc2nnc[nH]2)c1