Reaction Details
TargetIntestinal-type alkaline phosphatase
LigandBDBM60948
Substrate/Competitorn/a
Meas. Tech.Dose Response confirmation of uHTS inhibitors of Mouse Intestinal Alkaline Phosphatase using Human Intestinal Alkaline Phosphatase
IC50 13200±n/a nM
Citation PubChem, PC Dose Response confirmation of uHTS inhibitors of Mouse Intestinal Alkaline Phosphatase using Human Intestinal Alkaline Phosphatase PubChem Bioassay(2010)[AID]
 
Intestinal-type alkaline phosphatase
Name:Intestinal-type alkaline phosphatase
Type:PROTEIN
Mol. Mass.:56804.94
Organism:Homo sapiens (Human)
Description:ChEMBL_1278525
Residue:528
BDBM60948
NameBDBM60948
Synonyms:5-[2-[(5Z)-5-(furan-2-ylmethylidene)-4-oxidanylidene-2-sulfanylidene-1,3-thiazolidin-3-yl]ethanoylamino]-2-oxidanyl-benzoic acid 5-[[2-[(5Z)-5-(2-furfurylidene)-4-keto-2-thioxo-thiazolidin-3-yl]acetyl]amino]-2-hydroxy-benzoic acid MLS001157823 cid_6237665
TypeSmall organic molecule
Emp. Form.C17H12N2O6S2
Mol. Mass.404.417
SMILESOC(=O)c1cc(NC(=O)CN2C(=S)S\C(=C/c3ccco3)C2=O)ccc1O