Reaction Details
TargetIntestinal-type alkaline phosphatase
LigandBDBM76250
Substrate/Competitorn/a
Meas. Tech.Dose Response confirmation of uHTS inhibitors of Mouse Intestinal Alkaline Phosphatase using Human Intestinal Alkaline Phosphatase
IC50 9420±n/a nM
Citation PubChem, PC Dose Response confirmation of uHTS inhibitors of Mouse Intestinal Alkaline Phosphatase using Human Intestinal Alkaline Phosphatase PubChem Bioassay(2010)[AID]
 
Intestinal-type alkaline phosphatase
Name:Intestinal-type alkaline phosphatase
Type:PROTEIN
Mol. Mass.:56804.94
Organism:Homo sapiens (Human)
Description:ChEMBL_1278525
Residue:528
BDBM76250
NameBDBM76250
Synonyms:2-[(4-cyclopropyl-5-pyridin-4-yl-1,2,4-triazol-3-yl)sulfanyl]-N-(3-sulfamoylphenyl)acetamide 2-[(4-cyclopropyl-5-pyridin-4-yl-1,2,4-triazol-3-yl)thio]-N-(3-sulfamoylphenyl)acetamide MLS002161098 cid_16293880
TypeSmall organic molecule
Emp. Form.C18H18N6O3S2
Mol. Mass.430.504
SMILESNS(=O)(=O)c1cccc(NC(=O)CSc2nnc(-c3ccncc3)n2C2CC2)c1