Reaction Details
TargetAlkaline phosphatase, germ cell type
LigandBDBM76189
Substrate/Competitorn/a
Meas. Tech.Dose Response confirmation of uHTS inhibitors of Mouse Intestinal Alkaline Phosphatase using Placental Alkaline Phosphatase
IC50 5950±n/a nM
Citation PubChem, PC Dose Response confirmation of uHTS inhibitors of Mouse Intestinal Alkaline Phosphatase using Placental Alkaline Phosphatase PubChem Bioassay(2010)[AID]
 
Alkaline phosphatase, germ cell type
Name:Alkaline phosphatase, germ cell type
Type:PROTEIN
Mol. Mass.:57374.31
Organism:Homo sapiens (Human)
Description:ChEMBL_29964
Residue:532
BDBM76189
NameBDBM76189
Synonyms:(5-chloranyl-2-oxidanylidene-1,3-benzoxathiol-6-yl) N-cyclohexylcarbamate 5-chloro-2-oxo-1,3-benzoxathiol-6-yl cyclohexylcarbamate N-cyclohexylcarbamic acid (5-chloro-2-keto-1,3-benzoxathiol-6-yl) ester SMR000339621 | cid_691373
TypeSmall organic molecule
Emp. Form.C14H14ClNO4S
Mol. Mass.327.783
SMILESClc1cc2sc(=O)oc2cc1OC(=O)NC1CCCCC1