Reaction Details
TargetAlkaline phosphatase, germ cell type
LigandBDBM50085551
Substrate/Competitorn/a
Meas. Tech.Dose Response confirmation of uHTS inhibitors of Mouse Intestinal Alkaline Phosphatase using Placental Alkaline Phosphatase
IC50>100000±n/a nM
Citation PubChem, PC Dose Response confirmation of uHTS inhibitors of Mouse Intestinal Alkaline Phosphatase using Placental Alkaline Phosphatase PubChem Bioassay(2010)[AID]
 
Alkaline phosphatase, germ cell type
Name:Alkaline phosphatase, germ cell type
Type:PROTEIN
Mol. Mass.:57374.31
Organism:Homo sapiens (Human)
Description:ChEMBL_29964
Residue:532
BDBM50085551
NameBDBM50085551
Synonyms:1,8-Dihydroxy-3-hydroxymethyl-anthraquinone CHEMBL40275 aloe-emodin | cid_10207
TypeSmall organic molecule
Emp. Form.C15H10O5
Mol. Mass.270.2369
SMILESOCc1cc(O)c2C(=O)c3c(O)cccc3C(=O)c2c1