Reaction Details
TargetAlkaline phosphatase, tissue-nonspecific isozyme
LigandBDBM50242280
Substrate/Competitorn/a
Meas. Tech.Dose Response confirmation of uHTS inhibitors of Human Intestinal Alkaline Phosphatase using Tissue Nonspecific Alkaline Phosphatase.
IC50>100000±n/a nM
Citation PubChem, PC Dose Response confirmation of uHTS inhibitors of Human Intestinal Alkaline Phosphatase using Tissue Nonspecific Alkaline Phosphatase. PubChem Bioassay(2010)[AID]
 
Alkaline phosphatase, tissue-nonspecific isozyme
Name:Alkaline phosphatase, tissue-nonspecific isozyme
Type:PROTEIN
Mol. Mass.:57306.17
Organism:Homo sapiens (Human)
Description:ChEMBL_1448917
Residue:524
BDBM50242280
NameBDBM50242280
Synonyms:(2S,3S,4S,5R,6S)-6-(2-(3,4-dihydroxyphenyl)-5,7-dihydroxy-4-oxo-4H-chromen-3-yloxy)-3,4,5-trihydroxytetrahydro-2H-pyran-2-carboxylic acid Quercetin 3-O-beta-D-glucuronide cid_12004528 | quercetin glucuronide
TypeSmall organic molecule
Emp. Form.C21H18O13
Mol. Mass.478.3598
SMILESO[C@H]1[C@H](Oc2c(O)c3c(cc(O)cc3=O)oc2-c2ccc(O)c(O)c2)O[C@@H]([C@@H](O)[C@@H]1O)C(O)=O