Reaction Details
TargetDNA (cytosine-5)-methyltransferase 3A
LigandBDBM75324
Substrate/Competitorn/a
Meas. Tech.SAR Selectivity Analysis of small molecule inhibitors of PEST using pCAP in a fluorescence assay
IC50 216±n/a nM
Citation PubChem, PC SAR Selectivity Analysis of small molecule inhibitors of PEST using pCAP in a fluorescence assay PubChem Bioassay(2010)[AID]
 
DNA (cytosine-5)-methyltransferase 3A
Name:DNA (cytosine-5)-methyltransferase 3A
Type:PROTEIN
Mol. Mass.:101857.24
Organism:Homo sapiens (Human)
Description:ChEMBL_1510405
Residue:912
BDBM75324
NameBDBM75324
Synonyms:4-[5-[(Z)-[3-(4-nitrophenyl)-4-oxidanylidene-2-sulfanylidene-1,3-thiazolidin-5-ylidene]methyl]furan-2-yl]benzoic acid 4-[5-[(Z)-[3-(4-nitrophenyl)-4-oxo-2-sulfanylidene-5-thiazolidinylidene]methyl]-2-furanyl]benzoic acid MLS-0146245.0001 | cid_5341808
TypeSmall organic molecule
Emp. Form.C21H12N2O6S2
Mol. Mass.452.46
SMILESOC(=O)c1ccc(cc1)-c1ccc(\C=C2/SC(=S)N(C2=O)c2ccc(cc2)[N+]([O-])=O)o1