Reaction Details
TargetDNA (cytosine-5)-methyltransferase 3A
LigandBDBM46237
Substrate/Competitorn/a
Meas. Tech.SAR Selectivity Analysis of small molecule inhibitors of PEST using pCAP in a fluorescence assay
IC50 1130±n/a nM
Citation PubChem, PC SAR Selectivity Analysis of small molecule inhibitors of PEST using pCAP in a fluorescence assay PubChem Bioassay(2010)[AID]
 
DNA (cytosine-5)-methyltransferase 3A
Name:DNA (cytosine-5)-methyltransferase 3A
Type:PROTEIN
Mol. Mass.:101857.24
Organism:Homo sapiens (Human)
Description:ChEMBL_1510405
Residue:912
BDBM46237
NameBDBM46237
Synonyms:4-[3-[(5Z)-4-keto-2-thioxo-5-veratrylidene-thiazolidin-3-yl]propanoylamino]benzoic acid 4-[3-[(5Z)-5-[(3,4-dimethoxyphenyl)methylidene]-4-oxo-2-sulfanylidene-1,3-thiazolidin-3-yl]propanoylamino]benzoic acid MLS-0329775.0001 | cid_1587127
TypeSmall organic molecule
Emp. Form.C22H20N2O6S2
Mol. Mass.472.534
SMILESCOc1ccc(\C=C2/SC(=S)N(CCC(=O)Nc3ccc(cc3)C(O)=O)C2=O)cc1OC