Reaction Details
TargetDNA (cytosine-5)-methyltransferase 3A
LigandBDBM46244
Substrate/Competitorn/a
Meas. Tech.SAR Selectivity Analysis of small molecule inhibitors of PEST using pCAP in a fluorescence assay
IC50 2910±n/a nM
Citation PubChem, PC SAR Selectivity Analysis of small molecule inhibitors of PEST using pCAP in a fluorescence assay PubChem Bioassay(2010)[AID]
 
DNA (cytosine-5)-methyltransferase 3A
Name:DNA (cytosine-5)-methyltransferase 3A
Type:PROTEIN
Mol. Mass.:101857.24
Organism:Homo sapiens (Human)
Description:ChEMBL_1510405
Residue:912
BDBM46244
NameBDBM46244
Synonyms:3-[[(E)-3-[4-(4-chlorobenzyl)oxyphenyl]-2-cyano-acryloyl]amino]benzoic acid 3-[[(E)-3-[4-[(4-chlorophenyl)methoxy]phenyl]-2-cyano-prop-2-enoyl]amino]benzoic acid MLS-0334991.0001 | cid_1516220
TypeSmall organic molecule
Emp. Form.C24H17ClN2O4
Mol. Mass.432.856
SMILESOC(=O)c1cccc(NC(=O)C(=C\c2ccc(OCc3ccc(Cl)cc3)cc2)\C#N)c1