Reaction Details
TargetDNA (cytosine-5)-methyltransferase 3A
LigandBDBM46266
Substrate/Competitorn/a
Meas. Tech.SAR Selectivity Analysis of small molecule inhibitors of PEST using pCAP in a fluorescence assay
IC50 7630±n/a nM
Citation PubChem, PC SAR Selectivity Analysis of small molecule inhibitors of PEST using pCAP in a fluorescence assay PubChem Bioassay(2010)[AID]
 
DNA (cytosine-5)-methyltransferase 3A
Name:DNA (cytosine-5)-methyltransferase 3A
Type:PROTEIN
Mol. Mass.:101857.24
Organism:Homo sapiens (Human)
Description:ChEMBL_1510405
Residue:912
BDBM46266
NameBDBM46266
Synonyms:2-[2-chloranyl-4-[(E)-[5-(2-chlorophenyl)-6-ethoxycarbonyl-7-methyl-3-oxidanylidene-5H-[1,3]thiazolo[3,2-a]pyrimidin-2-ylidene]methyl]-6-methoxy-phenoxy]ethanoic acid 2-[2-chloro-4-[(E)-[5-(2-chlorophenyl)-6-ethoxycarbonyl-7-methyl-3-oxo-5H-thiazolo[3,2-a]pyrimidin-2-ylidene]methyl]-6-methoxyphenoxy]acetic acid MLS-0425579.0001 | cid_5346285
TypeSmall organic molecule
Emp. Form.C26H22Cl2N2O7S
Mol. Mass.577.433
SMILESCCOC(=O)C1=C(C)N=c2s\c(=C\c3cc(Cl)c(OCC(O)=O)c(OC)c3)c(=O)n2C1c1ccccc1Cl