Reaction Details
TargetDNA (cytosine-5)-methyltransferase 3A
LigandBDBM46270
Substrate/Competitorn/a
Meas. Tech.SAR Selectivity Analysis of small molecule inhibitors of PEST using pCAP in a fluorescence assay
IC50 7690±n/a nM
Citation PubChem, PC SAR Selectivity Analysis of small molecule inhibitors of PEST using pCAP in a fluorescence assay PubChem Bioassay(2010)[AID]
 
DNA (cytosine-5)-methyltransferase 3A
Name:DNA (cytosine-5)-methyltransferase 3A
Type:PROTEIN
Mol. Mass.:101857.24
Organism:Homo sapiens (Human)
Description:ChEMBL_1510405
Residue:912
BDBM46270
NameBDBM46270
Synonyms:2-[2-chloranyl-4-[(Z)-[2-[(4-ethylphenyl)amino]-4-oxidanylidene-1,3-thiazol-5-ylidene]methyl]phenoxy]ethanoic acid 2-[2-chloro-4-[(Z)-[2-(4-ethylanilino)-4-oxo-1,3-thiazol-5-ylidene]methyl]phenoxy]acetic acid MLS-0425585.0001 | cid_1737079
TypeSmall organic molecule
Emp. Form.C20H17ClN2O4S
Mol. Mass.416.878
SMILESCCc1ccc(NC2=NC(=O)C(S2)=Cc2ccc(OCC(O)=O)c(Cl)c2)cc1