Reaction Details
TargetDNA (cytosine-5)-methyltransferase 3A
LigandBDBM46272
Substrate/Competitorn/a
Meas. Tech.SAR Selectivity Analysis of small molecule inhibitors of PEST using pCAP in a fluorescence assay
IC50 7600±n/a nM
Citation PubChem, PC SAR Selectivity Analysis of small molecule inhibitors of PEST using pCAP in a fluorescence assay PubChem Bioassay(2010)[AID]
 
DNA (cytosine-5)-methyltransferase 3A
Name:DNA (cytosine-5)-methyltransferase 3A
Type:PROTEIN
Mol. Mass.:101857.24
Organism:Homo sapiens (Human)
Description:ChEMBL_1510405
Residue:912
BDBM46272
NameBDBM46272
Synonyms:2-[2-ethoxy-6-iodanyl-4-[(E)-(4-oxidanylidene-2-phenylazanyl-1,3-thiazol-5-ylidene)methyl]phenoxy]ethanoic acid 2-[4-[(E)-(2-anilino-4-oxo-1,3-thiazol-5-ylidene)methyl]-2-ethoxy-6-iodophenoxy]acetic acid MLS-0425587.0001 | cid_1756795
TypeSmall organic molecule
Emp. Form.C20H17IN2O5S
Mol. Mass.524.329
SMILESCCOc1cc(C=C2SC(Nc3ccccc3)=NC2=O)cc(I)c1OCC(O)=O