Reaction Details
TargetDNA (cytosine-5)-methyltransferase 3A
LigandBDBM48813
Substrate/Competitorn/a
Meas. Tech.SAR Selectivity Analysis of small molecule inhibitors of PEST using pCAP in a fluorescence assay
IC50 3130±n/a nM
Citation PubChem, PC SAR Selectivity Analysis of small molecule inhibitors of PEST using pCAP in a fluorescence assay PubChem Bioassay(2010)[AID]
 
DNA (cytosine-5)-methyltransferase 3A
Name:DNA (cytosine-5)-methyltransferase 3A
Type:PROTEIN
Mol. Mass.:101857.24
Organism:Homo sapiens (Human)
Description:ChEMBL_1510405
Residue:912
BDBM48813
NameBDBM48813
Synonyms:2-chloranyl-5-[5-[(Z)-[3-[(4-methoxyphenyl)methyl]-4-oxidanylidene-2-sulfanylidene-1,3-thiazolidin-5-ylidene]methyl]furan-2-yl]benzoic acid 2-chloro-5-[5-[(Z)-(4-keto-3-p-anisyl-2-thioxo-thiazolidin-5-ylidene)methyl]-2-furyl]benzoic acid 2-chloro-5-[5-[(Z)-[3-[(4-methoxyphenyl)methyl]-4-oxo-2-sulfanylidene-5-thiazolidinylidene]methyl]-2-furanyl]benzoic acid SMR000298745 | cid_2285453
TypeSmall organic molecule
Emp. Form.C23H16ClNO5S2
Mol. Mass.485.96
SMILESCOc1ccc(CN2C(=S)S\C(=C/c3ccc(o3)-c3ccc(Cl)c(c3)C(O)=O)C2=O)cc1