Reaction Details
TargetDNA (cytosine-5)-methyltransferase 3A
LigandBDBM61646
Substrate/Competitorn/a
Meas. Tech.SAR Selectivity Analysis of small molecule inhibitors of PEST using pCAP in a fluorescence assay
IC50 15800±n/a nM
Citation PubChem, PC SAR Selectivity Analysis of small molecule inhibitors of PEST using pCAP in a fluorescence assay PubChem Bioassay(2010)[AID]
 
DNA (cytosine-5)-methyltransferase 3A
Name:DNA (cytosine-5)-methyltransferase 3A
Type:PROTEIN
Mol. Mass.:101857.24
Organism:Homo sapiens (Human)
Description:ChEMBL_1510405
Residue:912
BDBM61646
NameBDBM61646
Synonyms:4-[4-(5-Benzylidene-4-oxo-2-thioxo-thiazolidin-3-yl)-butyrylamino]-benzoic acid 4-[4-[(5E)-5-benzal-4-keto-2-thioxo-thiazolidin-3-yl]butanoylamino]benzoic acid 4-[[1-oxo-4-[(5E)-4-oxo-5-(phenylmethylene)-2-sulfanylidene-3-thiazolidinyl]butyl]amino]benzoic acid SMR000608142 | cid_1416931
TypeSmall organic molecule
Emp. Form.C21H18N2O4S2
Mol. Mass.426.509
SMILESOC(=O)c1ccc(NC(=O)CCCN2C(=S)S\C(=C\c3ccccc3)C2=O)cc1