Reaction Details
TargetDNA (cytosine-5)-methyltransferase 3A
LigandBDBM65974
Substrate/Competitorn/a
Meas. Tech.SAR Selectivity Analysis of small molecule inhibitors of PEST using pCAP in a fluorescence assay
IC50 953±n/a nM
Citation PubChem, PC SAR Selectivity Analysis of small molecule inhibitors of PEST using pCAP in a fluorescence assay PubChem Bioassay(2010)[AID]
 
DNA (cytosine-5)-methyltransferase 3A
Name:DNA (cytosine-5)-methyltransferase 3A
Type:PROTEIN
Mol. Mass.:101857.24
Organism:Homo sapiens (Human)
Description:ChEMBL_1510405
Residue:912
BDBM65974
NameBDBM65974
Synonyms:3-[(5E)-5-[4-(4-chlorobenzyl)oxy-3-methoxy-benzylidene]-4-keto-2-thioxo-thiazolidin-3-yl]benzoic acid 3-[(5E)-5-[[4-[(4-chlorophenyl)methoxy]-3-methoxyphenyl]methylidene]-4-oxo-2-sulfanylidene-1,3-thiazolidin-3-yl]benzoic acid MLS-0435625.0001 | cid_16466007
TypeSmall organic molecule
Emp. Form.C25H18ClNO5S2
Mol. Mass.511.997
SMILESCOc1cc(\C=C2\SC(=S)N(C2=O)c2cccc(c2)C(O)=O)ccc1OCc1ccc(Cl)cc1