Reaction Details
TargetSentrin-specific protease 8
LigandBDBM48039
Substrate/Competitorn/a
Meas. Tech.Dose Response confirmation of uHTS for inhibitors of Sentrin-specific protease 8 (SENP8) using a Luminescent assay
IC50 1780±n/a nM
Citation PubChem, PC Dose Response confirmation of uHTS for inhibitors of Sentrin-specific protease 8 (SENP8) using a Luminescent assay PubChem Bioassay(2010)[AID]
 
Sentrin-specific protease 8
Name:Sentrin-specific protease 8
Type:Enzyme Catalytic Domain
Mol. Mass.:24104.52
Organism:Homo sapiens (Human)
Description:gi_262118306
Residue:212
BDBM48039
NameBDBM48039
Synonyms:3-[[(4E)-4-(2,4-dimethylphenyl)sulfonylimino-1-keto-2-naphthyl]amino]benzoic acid 3-[[(4E)-4-(2,4-dimethylphenyl)sulfonylimino-1-oxo-2-naphthalenyl]amino]benzoic acid MLS000948061 cid_5824726
TypeSmall organic molecule
Emp. Form.C25H20N2O5S
Mol. Mass.460.502
SMILESCc1ccc(c(C)c1)S(=O)(=O)N=C1C=C(Nc2cccc(c2)C(O)=O)C(=O)c2ccccc12